record_id,redcap_event_name,sid,unk_1___1,unk_2___1,age,unk_3___1,gender,unk_4___1,race,unk_5___1,ethnicity,unk_6___1,ins_adm,unk_7___1,blood,unk_8___1,ht,unk_9___1,ht_meters,wt,unk_10___1,bmi,subject_id_and_demographics_complete,dx_date,unk_11___1,los_acute,unk_12___1,icu,unk_13___1,los_icu,unk_14___1,steroid,unk_15___1,suppress,unk_16___1,mech_vent,unk_17___1,mech_vent_type,unk_18___1,trach,unk_19___1,prone,unk_20___1,ecmo,unk_21___1,ecmo_start,unk_22___1,ecmo_dur,unk_23___1,plasma,unk_24___1,ferritin,unk_25___1,crp,unk_26___1,ddimer,unk_27___1,il_6,unk_28___1,a1c,unk_29___1,adm_date,unk_30___1,med_cat___1,med_cat___2,med_cat___3,med_cat___4,med_cat___5,med_cat___6,med_cat___7,med_cat___9,med_cat___10,med_cat___11,med_cat___12,unk_31___1,impair___1,impair___2,impair___3,impair___4,impair___5,impair___6,impair___7,impair___8,impair___9,impair___10,impair___11,impair___12,impair___13,impair___14,impair___15,impair___16,impair___17,impair___18,impair___19,unk_32___1,impair_stroke___1,impair_stroke___2,impair_stroke___3,impair_stroke___4,impair_stroke___5,unk_33___1,impair_brain___1,impair_brain___2,impair_brain___3,impair_brain___4,unk_34___1,impair_neuro___1,impair_neuro___2,impair_neuro___3,impair_neuro___4,impair_neuro___5,impair_neuro___6,impair_neuro___7,unk_35___1,impair_nt_scd___1,impair_nt_scd___2,impair_nt_scd___3,impair_nt_scd___4,impair_nt_scd___5,impair_nt_scd___6,impair_nt_scd___7,impair_nt_scd___8,impair_nt_scd___9,unk_36___1,impair_t_scd___1,impair_t_scd___2,impair_t_scd___3,impair_t_scd___4,impair_t_scd___5,impair_t_scd___6,impair_t_scd___7,impair_t_scd___8,impair_t_scd___9,unk_37___1,impair_ampu___1,impair_ampu___2,impair_ampu___3,impair_ampu___4,impair_ampu___5,impair_ampu___6,impair_ampu___7,impair_ampu___8,unk_38___1,impair_arth___1,impair_arth___2,impair_arth___3,unk_39___1,impair_pain___1,impair_pain___2,impair_pain___3,impair_pain___4,unk_40___1,impair_ortho___1,impair_ortho___2,impair_ortho___3,impair_ortho___4,impair_ortho___5,impair_ortho___6,impair_ortho___7,impair_ortho___8,impair_ortho___9,impair_ortho___10,impair_ortho___11,impair_ortho___12,unk_41___1,impair_pulm___1,impair_pulm___2,unk_42___1,impair_cong___1,impair_cong___2,unk_43___1,impair_mmt___1,impair_mmt___2,impair_mmt___3,impair_mmt___4,unk_44___1,impair_complex___1,impair_complex___2,impair_complex___3,impair_complex___4,impair_complex___5,impair_complex___6,impair_complex___7,impair_complex___8,impair_complex___9,impair_complex___10,impair_complex___11,unk_45___1,dysph,unk_46___1,dysph_diet_adm,unk_47___1,dysph_liqdiet_adm,unk_48___1,dysph_diet_disch,unk_49___1,dysph_liqdiet_disch,unk_50___1,dysph_tube,unk_51___1,second___1,second___2,second___3,unk_52___1,second_neuro___1,second_neuro___2,second_neuro___3,second_neuro___4,second_neuro___5,second_neuro___6,second_neuro___7,unk_53___1,second_vasc___1,second_vasc___2,unk_54___1,second_pulm___1,second_pulm___2,unk_55___1,comorbid___1,comorbid___2,comorbid___3,comorbid___4,comorbid___5,comorbid___6,comorbid___7,comorbid___8,comorbid___9,comorbid___10,comorbid___11,comorbid___12,comorbid___13,unk_56___1,gg_tot_adm,unk_57___1,gg_tot_disch,unk_58___1,change_gg_tot,gg_cog_adm,unk_59___1,gg_mot_adm,unk_60___1,gg_mot_disch,unk_61___1,change_gg_mot,skin_incidence,unk_62___1,skin_stage_1,unk_63___1,skin_stage_2,unk_64___1,skin_stage_3,unk_65___1,skin_stage_4,unk_66___1,skin_location_1,unk_67___1,skin_location_2,unk_68___1,skin_location_3,unk_69___1,skin_location_4,unk_70___1,care,unk_71___1,los_care,unk_72___1,acute_reason___1,acute_reason___2,acute_reason___3,acute_reason___4,acute_reason___5,unk_73___1,confirm,disp,unk_74___1,o2,unk_75___1,o2_lpm,unk_76___1,retrospective_data_complete,los_sp,unk_77___1,icu_sp,unk_78___1,los_icu_sp,unk_79___1,steroid_sp,unk_80___1,suppress_sp,unk_81___1,mech_vent_sp,unk_82___1,trach_sp,unk_83___1,prone_sp,unk_84___1,ecmo_sp,unk_85___1,plasma_sp,unk_86___1,ferritin_sp,unk_87___1,crp_sp,unk_88___1,ddimer_sp,unk_89___1,il_6_sp,unk_90___1,a1c_sp,unk_91___1,impair_sp___1,impair_sp___2,impair_sp___3,impair_sp___4,impair_sp___5,impair_sp___6,impair_sp___7,impair_sp___8,impair_sp___9,impair_sp___10,impair_sp___11,impair_sp___12,impair_sp___13,impair_sp___14,impair_sp___15,impair_sp___16,impair_sp___17,impair_sp___18,impair_sp___19,unk_92___1,impair_stroke_sp___1,impair_stroke_sp___2,impair_stroke_sp___3,impair_stroke_sp___4,impair_stroke_sp___5,unk_93___1,impair_brain_sp___1,impair_brain_sp___2,impair_brain_sp___3,impair_brain_sp___4,unk_94___1,impair_neuro_sp___1,impair_neuro_sp___2,impair_neuro_sp___3,impair_neuro_sp___4,impair_neuro_sp___5,impair_neuro_sp___6,impair_neuro_sp___7,unk_95___1,impair_nt_scd_sp___1,impair_nt_scd_sp___2,impair_nt_scd_sp___3,impair_nt_scd_sp___4,impair_nt_scd_sp___5,impair_nt_scd_sp___6,impair_nt_scd_sp___7,impair_nt_scd_sp___8,impair_nt_scd_sp___9,unk_96___1,impair_t_scd_sp___1,impair_t_scd_sp___2,impair_t_scd_sp___3,impair_t_scd_sp___4,impair_t_scd_sp___5,impair_t_scd_sp___6,impair_t_scd_sp___7,impair_t_scd_sp___8,impair_t_scd_sp___9,unk_97___1,impair_ampu_sp___1,impair_ampu_sp___2,impair_ampu_sp___3,impair_ampu_sp___4,impair_ampu_sp___5,impair_ampu_sp___6,impair_ampu_sp___7,impair_ampu_sp___8,unk_98___1,impair_arth_sp___1,impair_arth_sp___2,impair_arth_sp___3,unk_99___1,impair_pain_sp___1,impair_pain_sp___2,impair_pain_sp___3,impair_pain_sp___4,unk_100___1,impair_ortho_sp___1,impair_ortho_sp___2,impair_ortho_sp___3,impair_ortho_sp___4,impair_ortho_sp___5,impair_ortho_sp___6,impair_ortho_sp___7,impair_ortho_sp___8,impair_ortho_sp___9,impair_ortho_sp___10,impair_ortho_sp___11,impair_ortho_sp___12,unk_101___1,impair_pulm_sp___1,impair_pulm_sp___2,unk_102___1,impair_cog_sp___1,impair_cog_sp___2,unk_103___1,impair_mmt_sp___1,impair_mmt_sp___2,impair_mmt_sp___3,impair_mmt_sp___4,unk_104___1,impair_complex_sp___1,impair_complex_sp___2,impair_complex_sp___3,impair_complex_sp___4,impair_complex_sp___5,impair_complex_sp___6,impair_complex_sp___7,impair_complex_sp___8,impair_complex_sp___9,impair_complex_sp___10,impair_complex_sp___11,unk_105___1,second_sp___1,second_sp___2,second_sp___3,unk_106___1,second_neuro_sp___1,second_neuro_sp___2,second_neuro_sp___3,second_neuro_sp___4,second_neuro_sp___5,second_neuro_sp___6,second_neuro_sp___7,unk_107___1,second_vasc_sp___1,second_vasc_sp___2,unk_108___1,second_pulm_sp___1,second_pulm_sp___2,unk_109___1,comorbid_sp___1,comorbid_sp___2,comorbid_sp___3,comorbid_sp___4,comorbid_sp___5,comorbid_sp___6,comorbid_sp___7,comorbid_sp___8,comorbid_sp___9,comorbid_sp___10,comorbid_sp___11,comorbid_sp___12,comorbid_sp___13,unk_110___1,gg_tot_adm_sp,unk_111___1,gg_tot_disch_sp,unk_112___1,gg_mot_adm_sp,unk_113___1,gg_mot_disch_sp,unk_114___1,skin_incidence_sp,unk_115___1,skin_stage_1_sp,unk_116___1,skin_stage_2_sp,unk_117___1,skin_stage_3_sp,unk_118___1,skin_stage_4_sp,unk_119___1,skin_location_1_sp,unk_120___1,skin_location_2_sp,unk_121___1,skin_location_3_sp,unk_122___1,skin_location_4_sp,unk_123___1,disp_sp,unk_124___1,skin_project_complete,transf_number,tot_los_rehab,los_acutecare,los_acutecare_2,los_acutecare_3,los_acutecare_4,transf_reason___1,transf_reason___2,transf_reason___3,transf_reason___4,transf_reason___5,transf_reason_2___1,transf_reason_2___2,transf_reason_2___3,transf_reason_2___4,transf_reason_2___5,transf_reason_3___1,transf_reason_3___2,transf_reason_3___3,transf_reason_3___4,transf_reason_3___5,transf_reason_4___1,transf_reason_4___2,transf_reason_4___3,transf_reason_4___4,transf_reason_4___5,bim_adm2,bim_adm3,bim_adm4,bim_adm5,gg_total_adm2,gg_total_adm3,gg_total_adm4,gg_total_adm5,gg_motor_adm2,gg_motor_adm3,gg_motor_adm4,gg_motor_adm5,draft_multiple_rehab_admissions_complete
3,baseline_retrospec_arm_1,1,0,0,66,0,1,0,6,0,2,0,4,0,,1,,1,,80.2,0,,2,4/9/2020,0,7,0,0,0,,0,0,0,0,0,0,0,,0,,0,0,0,0,0,,0,,0,0,0,528,0,1.05,0,750,0,,1,,1,4/16/2020,0,1,0,0,0,0,0,0,0,1,0,0,0,1,0,0,0,0,0,0,0,0,0,0,0,0,0,0,0,0,0,0,0,0,1,0,0,0,0,0,0,0,0,0,0,0,0,0,0,0,0,0,0,0,0,0,0,0,0,0,0,0,0,0,0,0,0,0,0,0,0,0,0,0,0,0,0,0,0,0,0,0,0,0,0,0,0,0,0,0,0,0,0,0,0,0,0,0,0,0,0,0,0,0,0,0,0,0,0,0,0,0,0,0,0,0,0,0,0,0,0,0,0,0,0,0,1,0,3,0,1,0,1,0,5,0,0,0,0,0,0,1,0,0,0,0,0,0,0,0,0,0,0,0,0,0,1,0,0,0,1,0,0,0,0,0,0,0,0,0,49,0,102,0,53,13,0,27,0,72,0,45,1,0,,0,,0,,0,,0,,0,,0,,0,,0,0,0,,0,0,0,0,0,0,0,,1,0,0,0,,0,2,,,,,,,,,,,,,,,,,,,,,,,,,,,,,,,,,,,,,,,,,,,,,,,,,,,,,,,,,,,,,,,,,,,,,,,,,,,,,,,,,,,,,,,,,,,,,,,,,,,,,,,,,,,,,,,,,,,,,,,,,,,,,,,,,,,,,,,,,,,,,,,,,,,,,,,,,,,,,,,,,,,,,,,,,,,,,,,,,,,,,,,,,,,,,,,,,,,,,,,,,,,,,5,21,,,,,0,0,0,0,0,0,0,0,0,0,0,0,0,0,0,0,0,0,0,0,,,,,,,,,,,,,2
3,skin_project_arm_1,,,,,,,,,,,,,,,,,,,,,,,,,,,,,,,,,,,,,,,,,,,,,,,,,,,,,,,,,,,,,,,,,,,,,,,,,,,,,,,,,,,,,,,,,,,,,,,,,,,,,,,,,,,,,,,,,,,,,,,,,,,,,,,,,,,,,,,,,,,,,,,,,,,,,,,,,,,,,,,,,,,,,,,,,,,,,,,,,,,,,,,,,,,,,,,,,,,,,,,,,,,,,,,,,,,,,,,,,,,,,,,,,,,,,,,,,,,,,,,,,,,,,,,,,,,,,,,,,,,,,,,,,,,,,,,,,,,,,,,,7,0,0,0,,0,0,0,0,0,0,0,,0,0,0,0,0,0,0,,1,,1,,1,,1,,1,1,0,0,0,0,0,0,0,0,0,0,0,0,0,0,0,0,0,0,0,0,1,0,0,0,0,0,0,0,0,0,0,0,0,0,0,0,0,0,0,0,0,0,0,0,0,0,0,0,0,0,0,0,0,0,0,0,0,0,0,0,0,0,0,0,0,0,0,0,0,0,0,0,0,0,0,0,0,0,0,0,0,0,0,0,0,0,0,0,0,0,0,0,0,0,0,0,0,0,0,0,0,0,0,0,0,0,0,0,0,0,0,0,0,0,0,0,0,0,0,0,0,0,0,0,0,0,0,0,0,0,1,0,0,0,1,0,0,0,0,0,0,0,0,0,49,0,102,0,27,0,72,0,1,0,,0,,0,,0,,0,,0,,0,,0,,0,1,0,0,,,,,,,,,,,,,,,,,,,,,,,,,,,,,,,,,,,,,,,
4,baseline_retrospec_arm_1,1,0,0,80,0,2,0,1,0,2,0,4,0,,1,162.6,0,1.626,60.9,0,23.03436318,2,4/6/2020,1,10,0,0,0,,0,0,0,0,0,0,0,,0,,0,0,0,0,0,,0,,0,0,0,601,0,0.51,0,158,0,,1,5.3,0,4/16/2020,0,1,0,0,1,0,0,0,0,0,0,0,0,0,0,1,0,0,0,0,0,0,0,0,0,0,0,0,0,1,0,0,0,0,0,0,0,0,0,0,0,0,0,0,0,0,0,1,0,0,0,0,0,0,0,0,0,0,0,0,0,0,0,0,0,0,0,0,0,0,0,0,0,0,0,0,0,0,0,0,0,0,0,0,0,0,0,0,0,0,0,0,0,0,0,0,0,0,0,0,0,0,0,0,0,0,0,0,0,0,0,0,0,0,0,0,0,0,0,0,0,0,0,0,0,0,0,0,,0,,0,,0,,0,,0,0,0,0,0,0,0,0,0,0,0,0,0,0,0,0,0,0,0,1,0,0,0,0,0,0,0,0,0,0,0,0,0,55,0,131,0,76,14,0,32,0,89,0,57,1,0,,0,,0,,0,,0,,0,,0,,0,,0,0,0,,0,0,0,0,0,0,0,,1,0,0,0,,0,2,,,,,,,,,,,,,,,,,,,,,,,,,,,,,,,,,,,,,,,,,,,,,,,,,,,,,,,,,,,,,,,,,,,,,,,,,,,,,,,,,,,,,,,,,,,,,,,,,,,,,,,,,,,,,,,,,,,,,,,,,,,,,,,,,,,,,,,,,,,,,,,,,,,,,,,,,,,,,,,,,,,,,,,,,,,,,,,,,,,,,,,,,,,,,,,,,,,,,,,,,,,,,5,18,,,,,0,0,0,0,0,0,0,0,0,0,0,0,0,0,0,0,0,0,0,0,,,,,,,,,,,,,2
4,skin_project_arm_1,,,,,,,,,,,,,,,,,,,,,,,,,,,,,,,,,,,,,,,,,,,,,,,,,,,,,,,,,,,,,,,,,,,,,,,,,,,,,,,,,,,,,,,,,,,,,,,,,,,,,,,,,,,,,,,,,,,,,,,,,,,,,,,,,,,,,,,,,,,,,,,,,,,,,,,,,,,,,,,,,,,,,,,,,,,,,,,,,,,,,,,,,,,,,,,,,,,,,,,,,,,,,,,,,,,,,,,,,,,,,,,,,,,,,,,,,,,,,,,,,,,,,,,,,,,,,,,,,,,,,,,,,,,,,,,,,,,,,,,,10,0,0,0,,0,0,0,0,0,0,0,,0,0,0,0,0,0,0,601,0,0.51,0,158,0,,1,5.3,0,0,0,1,0,0,0,0,0,0,0,0,0,0,0,0,0,1,0,0,0,0,0,0,0,0,0,0,0,0,0,0,0,0,0,1,0,0,0,0,0,0,0,0,0,0,0,0,0,0,0,0,0,0,0,0,0,0,0,0,0,0,0,0,0,0,0,0,0,0,0,0,0,0,0,0,0,0,0,0,0,0,0,0,0,0,0,0,0,0,0,0,0,0,0,0,0,0,0,0,0,0,0,0,0,0,0,0,0,0,0,0,0,0,0,0,0,0,0,0,0,0,0,0,0,0,0,0,0,0,0,0,1,0,0,0,0,0,0,0,0,0,0,0,0,0,55,0,131,0,32,0,89,0,1,0,,0,,0,,0,,0,,0,,0,,0,,0,1,0,0,,,,,,,,,,,,,,,,,,,,,,,,,,,,,,,,,,,,,,,
5,baseline_retrospec_arm_1,1,0,0,57,0,2,0,2,0,2,0,3,0,,1,157.5,0,1.575,86.1,0,34.70899471,2,3/14/2020,0,33,0,0,0,,0,1,0,1,0,0,0,,0,,0,0,0,0,0,,0,,0,1,0,799,0,31.63,0,362,0,197.8,0,8.3,0,4/17/2020,0,1,0,0,0,1,0,1,0,0,1,0,0,0,0,1,0,0,0,0,0,0,0,0,0,0,0,0,0,1,0,0,0,0,0,0,0,0,0,0,0,0,0,0,0,0,0,0,0,0,0,1,0,0,0,0,0,0,0,0,0,0,0,0,0,0,0,0,0,0,0,0,0,0,0,0,0,0,0,0,0,0,0,0,0,0,0,0,0,0,0,0,0,0,0,0,0,0,0,0,0,0,0,0,0,0,0,0,0,0,0,0,0,0,0,0,0,0,0,0,0,0,0,0,0,0,0,0,,0,,0,,0,,0,,0,0,0,1,0,0,0,0,0,0,0,0,0,0,0,0,1,0,0,1,1,1,0,0,0,0,0,0,0,0,0,0,0,27,0,101,0,74,7,0,15,0,73,0,58,1,0,,0,,0,,0,,0,,0,,0,,0,,0,0,0,,0,0,0,0,0,0,0,,1,0,0,0,,0,2,,,,,,,,,,,,,,,,,,,,,,,,,,,,,,,,,,,,,,,,,,,,,,,,,,,,,,,,,,,,,,,,,,,,,,,,,,,,,,,,,,,,,,,,,,,,,,,,,,,,,,,,,,,,,,,,,,,,,,,,,,,,,,,,,,,,,,,,,,,,,,,,,,,,,,,,,,,,,,,,,,,,,,,,,,,,,,,,,,,,,,,,,,,,,,,,,,,,,,,,,,,,,5,29,,,,,0,0,0,0,0,0,0,0,0,0,0,0,0,0,0,0,0,0,0,0,,,,,,,,,,,,,2
5,skin_project_arm_1,,,,,,,,,,,,,,,,,,,,,,,,,,,,,,,,,,,,,,,,,,,,,,,,,,,,,,,,,,,,,,,,,,,,,,,,,,,,,,,,,,,,,,,,,,,,,,,,,,,,,,,,,,,,,,,,,,,,,,,,,,,,,,,,,,,,,,,,,,,,,,,,,,,,,,,,,,,,,,,,,,,,,,,,,,,,,,,,,,,,,,,,,,,,,,,,,,,,,,,,,,,,,,,,,,,,,,,,,,,,,,,,,,,,,,,,,,,,,,,,,,,,,,,,,,,,,,,,,,,,,,,,,,,,,,,,,,,,,,,,33,0,0,0,,0,1,0,1,0,0,0,,0,0,0,0,0,1,0,799,0,31.63,0,362,0,197.8,0,8.3,0,0,0,1,0,0,0,0,0,0,0,0,0,0,0,0,0,1,0,0,0,0,0,0,0,0,0,0,0,0,0,0,0,0,0,0,0,0,0,1,0,0,0,0,0,0,0,0,0,0,0,0,0,0,0,0,0,0,0,0,0,0,0,0,0,0,0,0,0,0,0,0,0,0,0,0,0,0,0,0,0,0,0,0,0,0,0,0,0,0,0,0,0,0,0,0,0,0,0,0,0,0,0,0,0,0,0,0,0,0,0,0,0,0,0,0,1,0,0,0,0,0,0,0,0,0,0,0,0,1,0,0,1,1,1,0,0,0,0,0,0,0,0,0,0,0,27,0,101,0,15,0,73,0,1,0,,0,,0,,0,,0,,0,,0,,0,,0,1,0,0,,,,,,,,,,,,,,,,,,,,,,,,,,,,,,,,,,,,,,,
6,baseline_retrospec_arm_1,1,0,0,81,0,2,0,1,0,2,0,2,0,,1,167.64,0,1.6764,87.5,0,31.13527806,2,3/24/2020,0,24,0,0,0,,0,1,0,0,0,0,0,,0,,0,0,0,0,0,,0,,0,0,0,529,0,5.88,0,728,0,13.6,0,6.7,0,4/17/2020,0,1,0,0,0,0,1,1,1,1,0,0,0,0,0,0,0,0,0,0,0,0,0,0,0,0,0,0,0,1,0,0,0,0,0,0,0,0,0,0,0,0,0,0,0,0,0,0,0,0,0,0,0,0,0,0,0,0,0,0,0,0,0,0,0,0,0,0,0,0,0,0,0,0,0,0,0,0,0,0,0,0,0,0,0,0,0,0,0,0,0,0,0,0,0,0,0,0,0,0,0,0,0,0,0,0,0,0,0,0,0,0,0,0,0,0,0,0,0,0,0,0,0,0,0,0,1,0,2,0,5,0,2,0,5,0,0,0,0,0,1,0,0,0,0,0,0,0,0,0,0,0,0,1,1,0,1,1,1,0,1,0,1,0,0,0,0,0,0,0,32,0,88,0,56,12,0,15,0,53,0,38,1,0,,0,,0,,0,,0,,0,,0,,0,,0,0,0,,0,0,0,0,0,0,0,,1,0,1,0,2,0,2,,,,,,,,,,,,,,,,,,,,,,,,,,,,,,,,,,,,,,,,,,,,,,,,,,,,,,,,,,,,,,,,,,,,,,,,,,,,,,,,,,,,,,,,,,,,,,,,,,,,,,,,,,,,,,,,,,,,,,,,,,,,,,,,,,,,,,,,,,,,,,,,,,,,,,,,,,,,,,,,,,,,,,,,,,,,,,,,,,,,,,,,,,,,,,,,,,,,,,,,,,,,,5,38,,,,,0,0,0,0,0,0,0,0,0,0,0,0,0,0,0,0,0,0,0,0,,,,,,,,,,,,,2
6,skin_project_arm_1,,,,,,,,,,,,,,,,,,,,,,,,,,,,,,,,,,,,,,,,,,,,,,,,,,,,,,,,,,,,,,,,,,,,,,,,,,,,,,,,,,,,,,,,,,,,,,,,,,,,,,,,,,,,,,,,,,,,,,,,,,,,,,,,,,,,,,,,,,,,,,,,,,,,,,,,,,,,,,,,,,,,,,,,,,,,,,,,,,,,,,,,,,,,,,,,,,,,,,,,,,,,,,,,,,,,,,,,,,,,,,,,,,,,,,,,,,,,,,,,,,,,,,,,,,,,,,,,,,,,,,,,,,,,,,,,,,,,,,,,24,0,0,0,,0,1,0,0,0,0,0,,0,0,0,0,0,0,0,529,0,5.88,0,728,0,13.6,0,6.7,0,0,0,0,0,0,0,0,0,0,0,0,0,0,0,0,0,1,0,0,0,0,0,0,0,0,0,0,0,0,0,0,0,0,0,0,0,0,0,0,0,0,0,0,0,0,0,0,0,0,0,0,0,0,0,0,0,0,0,0,0,0,0,0,0,0,0,0,0,0,0,0,0,0,0,0,0,0,0,0,0,0,0,0,0,0,0,0,0,0,0,0,0,0,0,0,0,0,0,0,0,0,0,0,0,0,0,0,0,0,0,0,0,0,0,0,1,0,0,0,0,0,0,0,0,0,0,0,0,1,1,0,1,1,1,0,1,0,1,0,0,0,0,0,0,0,32,0,88,0,15,0,53,0,1,0,,0,,0,,0,,0,,0,,0,,0,,0,1,0,0,,,,,,,,,,,,,,,,,,,,,,,,,,,,,,,,,,,,,,,
7,baseline_retrospec_arm_1,1,0,0,52,0,1,0,4,0,2,0,4,0,,1,180.34,0,1.8034,88.7,0,27.27341301,2,4/13/2020,0,4,0,0,0,,0,0,0,0,0,0,0,,0,,0,0,0,0,0,,0,,0,0,0,461.4,0,19,0,320,0,,1,5.7,0,4/17/2020,0,1,0,0,0,0,0,0,0,1,0,0,0,1,0,0,0,0,0,0,0,0,0,1,0,0,0,0,0,0,0,0,0,0,0,1,0,0,0,0,0,0,0,0,0,0,0,0,0,0,0,0,0,0,0,0,0,0,0,0,0,0,0,0,0,0,0,0,0,0,0,0,0,0,0,0,0,0,0,0,0,0,0,0,0,0,0,0,0,0,0,0,0,0,0,0,0,0,0,0,0,0,0,0,1,0,0,0,0,0,0,0,0,0,0,0,0,0,0,0,0,0,0,0,0,0,0,0,,0,,0,,0,,0,,0,1,0,0,0,1,0,0,0,0,0,0,0,0,0,0,0,0,0,1,0,0,0,0,0,0,0,0,0,0,0,0,0,57,0,101,0,44,15,0,32,0,70,0,38,1,0,,0,,0,,0,,0,,0,,0,,0,,0,0,0,,0,0,0,0,0,0,0,,1,0,0,0,,0,2,,,,,,,,,,,,,,,,,,,,,,,,,,,,,,,,,,,,,,,,,,,,,,,,,,,,,,,,,,,,,,,,,,,,,,,,,,,,,,,,,,,,,,,,,,,,,,,,,,,,,,,,,,,,,,,,,,,,,,,,,,,,,,,,,,,,,,,,,,,,,,,,,,,,,,,,,,,,,,,,,,,,,,,,,,,,,,,,,,,,,,,,,,,,,,,,,,,,,,,,,,,,,5,14,,,,,0,0,0,0,0,0,0,0,0,0,0,0,0,0,0,0,0,0,0,0,,,,,,,,,,,,,2
7,skin_project_arm_1,,,,,,,,,,,,,,,,,,,,,,,,,,,,,,,,,,,,,,,,,,,,,,,,,,,,,,,,,,,,,,,,,,,,,,,,,,,,,,,,,,,,,,,,,,,,,,,,,,,,,,,,,,,,,,,,,,,,,,,,,,,,,,,,,,,,,,,,,,,,,,,,,,,,,,,,,,,,,,,,,,,,,,,,,,,,,,,,,,,,,,,,,,,,,,,,,,,,,,,,,,,,,,,,,,,,,,,,,,,,,,,,,,,,,,,,,,,,,,,,,,,,,,,,,,,,,,,,,,,,,,,,,,,,,,,,,,,,,,,,4,0,0,0,,0,0,0,0,0,0,0,,0,0,0,0,0,0,0,461.4,0,19,0,320,0,,1,5.7,0,1,0,0,0,0,0,0,0,0,0,1,0,0,0,0,0,0,0,0,0,0,0,1,0,0,0,0,0,0,0,0,0,0,0,0,0,0,0,0,0,0,0,0,0,0,0,0,0,0,0,0,0,0,0,0,0,0,0,0,0,0,0,0,0,0,0,0,0,0,0,0,0,0,0,0,0,0,0,0,0,0,0,0,0,0,0,0,0,0,0,0,1,0,0,0,0,0,0,0,0,0,0,0,0,0,0,0,0,0,0,0,0,0,1,0,0,0,1,0,0,0,0,0,0,0,0,0,0,0,0,0,1,0,0,0,0,0,0,0,0,0,0,0,0,0,57,0,101,0,32,0,70,0,1,0,,0,,0,,0,,0,,0,,0,,0,,0,1,0,0,,,,,,,,,,,,,,,,,,,,,,,,,,,,,,,,,,,,,,,
11,baseline_retrospec_arm_1,1,0,0,54,0,1,0,2,0,2,0,4,0,6,0,177.8,0,1.778,102.2,0,32.32863609,2,4/10/2020,0,11,0,1,0,2,0,0,0,0,0,1,0,1,0,0,0,0,0,0,0,,0,,0,0,0,1073,0,107.6,0,2067,0,34.7,0,,1,4/21/2020,0,1,0,0,0,1,0,0,1,0,0,0,0,0,0,0,0,0,1,0,0,0,0,0,0,0,0,0,0,0,0,0,0,0,0,0,0,0,0,0,0,0,0,0,0,0,0,0,0,0,0,0,0,0,0,0,0,0,0,0,0,0,0,0,0,0,0,0,0,0,0,0,0,0,1,0,0,0,0,0,0,0,0,0,0,0,0,0,0,0,0,0,0,0,0,0,0,0,0,0,0,0,0,0,0,0,0,0,0,0,0,0,0,0,0,0,0,0,0,0,0,0,0,0,0,0,0,0,,0,,0,,0,,0,,0,0,0,1,0,0,0,0,0,0,0,0,0,0,0,0,1,0,0,0,1,0,0,0,0,0,0,0,0,0,0,0,0,48,0,80,0,32,15,0,21,0,46,0,25,1,0,,0,,0,,0,,0,,0,,0,,0,,0,0,0,,0,0,0,0,0,0,0,,3,0,,0,,0,2,,,,,,,,,,,,,,,,,,,,,,,,,,,,,,,,,,,,,,,,,,,,,,,,,,,,,,,,,,,,,,,,,,,,,,,,,,,,,,,,,,,,,,,,,,,,,,,,,,,,,,,,,,,,,,,,,,,,,,,,,,,,,,,,,,,,,,,,,,,,,,,,,,,,,,,,,,,,,,,,,,,,,,,,,,,,,,,,,,,,,,,,,,,,,,,,,,,,,,,,,,,,,5,14,,,,,0,0,0,0,0,0,0,0,0,0,0,0,0,0,0,0,0,0,0,0,,,,,,,,,,,,,2
11,skin_project_arm_1,,,,,,,,,,,,,,,,,,,,,,,,,,,,,,,,,,,,,,,,,,,,,,,,,,,,,,,,,,,,,,,,,,,,,,,,,,,,,,,,,,,,,,,,,,,,,,,,,,,,,,,,,,,,,,,,,,,,,,,,,,,,,,,,,,,,,,,,,,,,,,,,,,,,,,,,,,,,,,,,,,,,,,,,,,,,,,,,,,,,,,,,,,,,,,,,,,,,,,,,,,,,,,,,,,,,,,,,,,,,,,,,,,,,,,,,,,,,,,,,,,,,,,,,,,,,,,,,,,,,,,,,,,,,,,,,,,,,,,,,11,0,1,0,2,0,0,0,0,0,1,0,0,0,0,0,0,0,0,0,1073,0,107.6,0,2067,0,34.7,0,,1,0,0,0,0,0,1,0,0,0,0,0,0,0,0,0,0,0,0,0,0,0,0,0,0,0,0,0,0,0,0,0,0,0,0,0,0,0,0,0,0,0,0,0,0,0,0,0,0,0,0,0,0,0,0,0,0,0,0,0,0,0,1,0,0,0,0,0,0,0,0,0,0,0,0,0,0,0,0,0,0,0,0,0,0,0,0,0,0,0,0,0,0,0,0,0,0,0,0,0,0,0,0,0,0,0,0,0,0,0,0,0,0,0,0,0,1,0,0,0,0,0,0,0,0,0,0,0,0,1,0,0,0,1,0,0,0,0,0,0,0,0,0,0,0,0,48,0,80,0,21,0,46,0,1,0,,0,,0,,0,,0,,0,,0,,0,,0,3,0,0,,,,,,,,,,,,,,,,,,,,,,,,,,,,,,,,,,,,,,,
12,baseline_retrospec_arm_1,1,0,0,77,0,1,0,1,0,2,0,4,0,,1,172.7,0,1.727,71.2,0,23.87235799,2,4/13/2020,0,8,0,0,0,,0,1,0,0,0,0,0,,0,,0,0,0,0,0,,0,,0,0,0,785,0,8.24,0,340,0,6.2,0,,1,4/21/2020,0,1,0,0,0,0,0,0,0,1,0,0,0,0,0,0,0,0,0,0,0,0,0,0,0,0,0,0,0,1,0,0,0,0,0,0,0,0,0,0,0,0,0,0,0,0,0,0,0,0,0,0,0,0,0,0,0,0,0,0,0,0,0,0,0,0,0,0,0,0,0,0,0,0,0,0,0,0,0,0,0,0,0,0,0,0,0,0,0,0,0,0,0,0,0,0,0,0,0,0,0,0,0,0,0,0,0,0,0,0,0,0,0,0,0,0,0,0,0,0,0,0,0,0,0,0,0,0,,0,,0,,0,,0,,0,0,0,0,0,0,0,0,0,0,0,0,0,0,0,0,0,0,0,1,0,0,0,1,0,1,0,0,1,0,0,0,0,71,0,132,0,61,15,0,45,0,90,0,45,1,0,,0,,0,,0,,0,,0,,0,,0,,0,0,0,,0,0,0,0,0,0,0,,1,0,1,0,2,0,2,,,,,,,,,,,,,,,,,,,,,,,,,,,,,,,,,,,,,,,,,,,,,,,,,,,,,,,,,,,,,,,,,,,,,,,,,,,,,,,,,,,,,,,,,,,,,,,,,,,,,,,,,,,,,,,,,,,,,,,,,,,,,,,,,,,,,,,,,,,,,,,,,,,,,,,,,,,,,,,,,,,,,,,,,,,,,,,,,,,,,,,,,,,,,,,,,,,,,,,,,,,,,5,11,,,,,0,0,0,0,0,0,0,0,0,0,0,0,0,0,0,0,0,0,0,0,,,,,,,,,,,,,2
12,skin_project_arm_1,,,,,,,,,,,,,,,,,,,,,,,,,,,,,,,,,,,,,,,,,,,,,,,,,,,,,,,,,,,,,,,,,,,,,,,,,,,,,,,,,,,,,,,,,,,,,,,,,,,,,,,,,,,,,,,,,,,,,,,,,,,,,,,,,,,,,,,,,,,,,,,,,,,,,,,,,,,,,,,,,,,,,,,,,,,,,,,,,,,,,,,,,,,,,,,,,,,,,,,,,,,,,,,,,,,,,,,,,,,,,,,,,,,,,,,,,,,,,,,,,,,,,,,,,,,,,,,,,,,,,,,,,,,,,,,,,,,,,,,,8,0,0,0,,0,1,0,0,0,0,0,,0,0,0,0,0,0,0,785,0,8.24,0,340,0,6.2,0,,1,0,0,0,0,0,0,0,0,0,0,0,0,0,0,0,0,1,0,0,0,0,0,0,0,0,0,0,0,0,0,0,0,0,0,0,0,0,0,0,0,0,0,0,0,0,0,0,0,0,0,0,0,0,0,0,0,0,0,0,0,0,0,0,0,0,0,0,0,0,0,0,0,0,0,0,0,0,0,0,0,0,0,0,0,0,0,0,0,0,0,0,0,0,0,0,0,0,0,0,0,0,0,0,0,0,0,0,0,0,0,0,0,0,0,0,0,0,0,0,0,0,0,0,0,0,0,0,0,0,0,0,1,0,0,0,1,0,1,0,0,1,0,0,0,0,71,0,132,0,45,0,90,0,1,0,,0,,0,,0,,0,,0,,0,,0,,0,1,0,0,,,,,,,,,,,,,,,,,,,,,,,,,,,,,,,,,,,,,,,
14,baseline_retrospec_arm_1,1,0,0,59,0,2,0,6,0,1,0,4,0,1,0,157.48,0,1.5748,69,0,27.82263629,2,3/29/2020,0,24,0,1,0,16,0,1,0,0,0,1,0,1,0,0,0,0,0,0,0,,0,,0,0,0,2426,0,26.82,0,1040,0,3.8,0,,1,4/22/2020,0,1,0,0,0,0,0,0,1,0,0,0,0,0,0,0,0,0,0,0,0,0,0,0,0,0,0,0,0,1,0,0,0,0,0,0,0,0,0,0,0,0,0,0,0,0,0,0,0,0,0,0,0,0,0,0,0,0,0,0,0,0,0,0,0,0,0,0,0,0,0,0,0,0,0,0,0,0,0,0,0,0,0,0,0,0,0,0,0,0,0,0,0,0,0,0,0,0,0,0,0,0,0,0,0,0,0,0,0,0,0,0,0,0,0,0,0,0,0,0,0,0,0,0,0,0,1,0,2,0,1,0,1,0,5,0,0,0,1,0,1,0,0,0,0,0,0,0,1,0,0,0,0,1,0,0,0,1,0,0,1,0,0,0,0,0,0,0,0,0,53,0,118,0,65,15,0,27,0,78,0,51,1,0,,0,,0,,0,,0,,0,,0,,0,,0,0,0,,0,0,0,0,0,0,0,,1,0,0,0,,0,2,,,,,,,,,,,,,,,,,,,,,,,,,,,,,,,,,,,,,,,,,,,,,,,,,,,,,,,,,,,,,,,,,,,,,,,,,,,,,,,,,,,,,,,,,,,,,,,,,,,,,,,,,,,,,,,,,,,,,,,,,,,,,,,,,,,,,,,,,,,,,,,,,,,,,,,,,,,,,,,,,,,,,,,,,,,,,,,,,,,,,,,,,,,,,,,,,,,,,,,,,,,,,5,16,,,,,0,0,0,0,0,0,0,0,0,0,0,0,0,0,0,0,0,0,0,0,,,,,,,,,,,,,2
14,skin_project_arm_1,,,,,,,,,,,,,,,,,,,,,,,,,,,,,,,,,,,,,,,,,,,,,,,,,,,,,,,,,,,,,,,,,,,,,,,,,,,,,,,,,,,,,,,,,,,,,,,,,,,,,,,,,,,,,,,,,,,,,,,,,,,,,,,,,,,,,,,,,,,,,,,,,,,,,,,,,,,,,,,,,,,,,,,,,,,,,,,,,,,,,,,,,,,,,,,,,,,,,,,,,,,,,,,,,,,,,,,,,,,,,,,,,,,,,,,,,,,,,,,,,,,,,,,,,,,,,,,,,,,,,,,,,,,,,,,,,,,,,,,,24,0,1,0,16,0,1,0,0,0,1,0,0,0,0,0,0,0,0,0,2426,0,26.82,0,1040,0,3.8,0,,1,0,0,0,0,0,0,0,0,0,0,0,0,0,0,0,0,1,0,0,0,0,0,0,0,0,0,0,0,0,0,0,0,0,0,0,0,0,0,0,0,0,0,0,0,0,0,0,0,0,0,0,0,0,0,0,0,0,0,0,0,0,0,0,0,0,0,0,0,0,0,0,0,0,0,0,0,0,0,0,0,0,0,0,0,0,0,0,0,0,0,0,0,0,0,0,0,0,0,0,0,0,0,0,0,0,0,0,0,0,0,0,0,0,1,0,1,0,0,0,0,0,0,0,1,0,0,0,0,1,0,0,0,1,0,0,1,0,0,0,0,0,0,0,0,0,53,0,118,0,27,0,78,0,1,0,,0,,0,,0,,0,,0,,0,,0,,0,1,0,0,,,,,,,,,,,,,,,,,,,,,,,,,,,,,,,,,,,,,,,
15,baseline_retrospec_arm_1,1,0,0,67,0,1,0,6,0,1,0,4,0,,1,175,0,1.75,62.3,0,20.34285714,2,3/16/2020,0,37,0,1,0,21,0,1,0,0,0,1,0,1,0,0,0,0,0,0,0,,0,,0,0,0,3506,0,33.03,0,5210,0,3.6,0,5.5,0,4/22/2020,0,1,0,0,0,0,0,0,0,0,0,0,0,0,0,0,0,0,0,0,0,0,0,0,0,0,0,0,0,1,0,0,0,0,0,0,0,0,0,0,0,0,0,0,0,0,0,0,0,0,0,0,0,0,0,0,0,0,0,0,0,0,0,0,0,0,0,0,0,0,0,0,0,0,0,0,0,0,0,0,0,0,0,0,0,0,0,0,0,0,0,0,0,0,0,0,0,0,0,0,0,0,0,0,0,0,0,0,0,0,0,0,0,0,0,0,0,0,0,0,0,0,0,0,0,0,0,0,,0,,0,,0,,0,,0,1,0,0,0,1,0,0,0,0,0,0,0,0,0,0,0,0,0,1,0,0,0,0,0,0,0,0,0,0,0,0,0,61,0,132,0,71,15,0,32,0,90,0,58,1,0,,0,,0,,0,,0,,0,,0,,0,,0,0,0,,0,0,0,0,0,0,0,,1,0,0,0,,0,2,,,,,,,,,,,,,,,,,,,,,,,,,,,,,,,,,,,,,,,,,,,,,,,,,,,,,,,,,,,,,,,,,,,,,,,,,,,,,,,,,,,,,,,,,,,,,,,,,,,,,,,,,,,,,,,,,,,,,,,,,,,,,,,,,,,,,,,,,,,,,,,,,,,,,,,,,,,,,,,,,,,,,,,,,,,,,,,,,,,,,,,,,,,,,,,,,,,,,,,,,,,,,5,10,,,,,0,0,0,0,0,0,0,0,0,0,0,0,0,0,0,0,0,0,0,0,,,,,,,,,,,,,2
15,skin_project_arm_1,,,,,,,,,,,,,,,,,,,,,,,,,,,,,,,,,,,,,,,,,,,,,,,,,,,,,,,,,,,,,,,,,,,,,,,,,,,,,,,,,,,,,,,,,,,,,,,,,,,,,,,,,,,,,,,,,,,,,,,,,,,,,,,,,,,,,,,,,,,,,,,,,,,,,,,,,,,,,,,,,,,,,,,,,,,,,,,,,,,,,,,,,,,,,,,,,,,,,,,,,,,,,,,,,,,,,,,,,,,,,,,,,,,,,,,,,,,,,,,,,,,,,,,,,,,,,,,,,,,,,,,,,,,,,,,,,,,,,,,,37,0,1,0,21,0,1,0,0,0,1,0,0,0,0,0,0,0,0,0,3506,0,33.03,0,5210,0,3.6,0,5.5,0,0,0,0,0,0,0,0,0,0,0,0,0,0,0,0,0,1,0,0,0,0,0,0,0,0,0,0,0,0,0,0,0,0,0,0,0,0,0,0,0,0,0,0,0,0,0,0,0,0,0,0,0,0,0,0,0,0,0,0,0,0,0,0,0,0,0,0,0,0,0,0,0,0,0,0,0,0,0,0,0,0,0,0,0,0,0,0,0,0,0,0,0,0,0,0,0,0,0,0,0,0,0,0,0,0,0,0,0,0,0,0,0,0,1,0,0,0,1,0,0,0,0,0,0,0,0,0,0,0,0,0,1,0,0,0,0,0,0,0,0,0,0,0,0,0,61,0,132,0,32,0,90,0,1,0,,0,,0,,0,,0,,0,,0,,0,,0,1,0,0,,,,,,,,,,,,,,,,,,,,,,,,,,,,,,,,,,,,,,,
16,baseline_retrospec_arm_1,1,0,0,49,0,2,0,4,0,2,0,4,0,,1,154.94,0,1.5494,59.2,0,24.66008694,2,4/4/2020,0,18,0,0,0,,0,0,0,1,0,0,0,,0,,0,0,0,0,0,,0,,0,0,0,522.3,0,119.3,0,284,0,2.3,0,,1,4/22/2020,0,0,0,0,0,0,0,0,0,0,0,0,0,0,0,0,0,0,0,0,0,0,0,0,0,0,0,0,0,1,0,0,0,0,0,0,0,0,0,0,0,0,0,0,0,0,0,0,0,0,0,0,0,0,0,0,0,0,0,0,0,0,0,0,0,0,0,0,0,0,0,0,0,0,0,0,0,0,0,0,0,0,0,0,0,0,0,0,0,0,0,0,0,0,0,0,0,0,0,0,0,0,0,0,0,0,0,0,0,0,0,0,0,0,0,0,0,0,0,0,0,0,0,0,0,0,1,0,2,0,1,0,1,0,1,0,0,0,1,0,0,0,0,1,0,0,0,0,0,0,0,0,0,0,0,0,1,0,0,0,0,0,0,0,0,0,0,0,0,0,54,0,122,0,68,15,0,34,0,80,0,46,1,0,,0,,0,,0,,0,,0,,0,,0,,0,0,0,,0,0,0,0,0,0,0,,1,0,0,0,,0,2,,,,,,,,,,,,,,,,,,,,,,,,,,,,,,,,,,,,,,,,,,,,,,,,,,,,,,,,,,,,,,,,,,,,,,,,,,,,,,,,,,,,,,,,,,,,,,,,,,,,,,,,,,,,,,,,,,,,,,,,,,,,,,,,,,,,,,,,,,,,,,,,,,,,,,,,,,,,,,,,,,,,,,,,,,,,,,,,,,,,,,,,,,,,,,,,,,,,,,,,,,,,,5,10,,,,,0,0,0,0,0,0,0,0,0,0,0,0,0,0,0,0,0,0,0,0,,,,,,,,,,,,,2